Error C2988 Unrecognizable Template Declaration/definition

Home / Error C2988 Unrecognizable Template Declaration/definition

9.5 Field Declaration Syntax

RECOMMENDED: If you have Windows errors then we strongly recommend that you download and run this (Windows) Repair Tool.

Compiler Errors C2900 Through C2999 Compiler Error C2988. Compiler. C2988. Compiler Error C2901. unrecognizable template declaration/definition.

error C2988: unrecognizable template declaration/definition. – Not a member of Pastebin yet? Sign Up, it unlocks many cool features! raw download clone embed report print text 0.95 KB error C2988: unrecognizable template.

array’ : undeclared identifier 1>c:boost_1_54_0boostfunctionalhashextensions.hpp(131): error C2988: unrecognizable template declaration/definition 1>c:boost_1_54_0boostfunctionalhashextensions.hpp(131): error C2059: syntax.

Class Templates, C2988 Error. error C2988: unrecognizable template declaration. First there is a missing semicolon at the end of the template declaration.

Jun 9, 2015. You are missing the return type of the function parameter of the second function. template <typename T1, typename T2> void.

h(108): error C2433: ‘hash’ : ‘inline’ not permitted on data declarations srcutil/ hash/hash. h(108): error C2988: unrecognizable template declaration/ definition

Need to control something with a Joystick in Windows? Here is an easy to use driver that will help you do it. When I wanted to create a Joystick driver so I could control my robot via a joystick plugged into my computer one of the first.

Failed Rpc Error Successretrying How Do I Fix Error C00d1199 You can fix this error in several different ways, including updating your codecs for your Windows Media Player, Here's how you do it… How To Fix The c00d1199. Error C00D1199 appears when Windows Media Player is unable to play the file requested. It can be caused by faulty configurations.
How Do I Fix Error C00d1199 You can fix this error in several different ways, including updating your codecs for your Windows Media Player, Here's how you do it… How To Fix The c00d1199. Error C00D1199 appears when Windows Media Player is unable to play the file requested. It can be caused by faulty configurations. Learn how to fix this error.

compile visual studio c++ online – Note: C++ does not support default-int source_file.cpp(7): error C2988: unrecognizable template declaration/definition source_file.cpp(7): error C2143: syntax error: missing ‘,’ before ‘<‘ source_file.cpp(20): error C2065: ‘vector’:.

. is node-gyp supposed to work with node 4.0 ?. (336): error C2988: unrecognizable template declaration. error C2988: unrecognizable template declaration.

Jan 15, 2016. The compiler is complaining about Node<E> ; there is no template named Node in global scope. The code has to say that it's the member.

Visual C++ template syntax errors. Error 2 error C2143. engine2\sprite.cpp 7 1 Engine2 Error 4 error C2988: unrecognizable template declaration.

Compiler Error C2902 ‘token’: unexpected token following ‘template/generic’, identifier expected Compiler Error C2903 ‘identifier’: symbol is neither a class template/generic nor a function template/generic Compiler Error C2904 ‘identifier’:.

May 20, 2017. error C2988: unrecognizable template declaration/definition c:users36996 appdatalocaltemppip-build-8hj30bdcwmdemd.h(82): error.

. declaration of ‘MyIntf<T>::g’ 1> with 1> [ 1> T=int 1> ] 1>bugreportbugreportmain.cpp(22): error C2988:.

Compiler Errors C2900 Through C3499 Compiler Error C2988. Compiler. C2988. Compiler Error C2902. unrecognizable template declaration/definition.

Unrevoked Forever Error Status 42 Chapter 160A. Cities and Towns. Article 1. Definitions and Statutory Construction. § 160A-1. Application and meaning of terms. Unless otherwise specifically provided. Need HELP to ROOT HTC EVO. Used Unrevoked. | HTC Supersonic. – Need HELP to ROOT HTC EVO. Used Unrevoked 3 and STUCK on. error in /data/local/unrevoked-forever.zip (status 42). error in /data/local/unrevoked-forever.zip. If

I get the error in the title on two of my templates. Both have similar declarations and definitions as follows: template <typename T1, typename T2> void.

You are missing the return type of the function parameter of the second function. template <typename T1, typename T2> void EncoderPrivate::setVideoCodecOption(T1.

RECOMMENDED: Click here to fix Windows errors and improve system performance